PEPPLER.ORG
Michael Peppler
Sybase Consulting
Menu
Home
Sybase on Linux
Install Guide for Sybase on Linux
General Sybase Resources
General Perl Resources
Freeware
Sybperl
Sybase::Simple
DBD::Sybase
BCP Tool
Bug Tracker
Mailing List Archive
Downloads Directory
FAQs
Sybase on Linux FAQ
Sybperl FAQ
Personal
Michael Peppler's resume

sybperl-l Archive

Up    Prev    Next    

From: Abhin Parkhi <arp551 at yahoo dot com>
Subject: Error while building sybperl on Windows 2000
Date: Apr 16 2003 1:56PM

Hi,

I am trying to build Sybperl 2.15 on a Windows 2000 machine. I have 
Sybase 12.5 and Activestate perl 5.8.0. Here is the error that I get while 
making test.

Thanks!

-- Abhin

C:\MYDOWN~1\SYBPER~1.15>nmake test

Microsoft (R) Program Maintenance Utility Version 7.00.9466
Copyright (C) Microsoft Corporation.  All rights reserved.

        C:\Perl\bin\perl.exe "-MExtUtils::Command::MM" "-e" 
"test_harness(0, '..
\blib\lib', '..\blib\arch')" t\bcp.t
t\bcp....Your vendor has not defined Sybase::DBlib macro TRUE at 
t\bcp.t line 44

t\bcp....dubious
        Test returned status 255 (wstat 65280, 0xff00)
DIED. FAILED tests 2-9
        Failed 8/9 tests, 11.11% okay
Failed Test Stat Wstat Total Fail  Failed  List of Failed
-------------------------------------------------------------------------------
t\bcp.t      255 65280     9    8  88.89%  2-9
Failed 1/1 test scripts, 0.00% okay. 8/9 subtests failed, 11.11% okay.
NMAKE : fatal error U1077: 'C:\Perl\bin\perl.exe' : return code '0x2'
Stop.
NMAKE : fatal error U1077: 'cd' : return code '0x2'
Stop.

Thanks,Abhin




---------------------------------
Do you Yahoo!?
The New Yahoo! Search - Faster. Easier. Bingo.