PEPPLER.ORG
Michael Peppler
Sybase Consulting
Menu
Home
Sybase on Linux
Install Guide for Sybase on Linux
General Sybase Resources
General Perl Resources
Freeware
Sybperl
Sybase::Simple
DBD::Sybase
BCP Tool
Bug Tracker
Mailing List Archive
Downloads Directory
FAQs
Sybase on Linux FAQ
Sybperl FAQ
Personal
Michael Peppler's resume

sybperl-l Archive

Up    Prev    Next    

From: "Mark A dot Downing" <mdowning at wm7d dot net>
Subject: redhat 8 and syb_perl 2.15
Date: Nov 20 2002 4:41PM

I am having difficulty getting sybperl 2.15 to work. Not sure why... as it
appears to compile fine.

config works, and make appears to run successfully, but make test gives
the following strange output:

[root@www2 sybperl-2.15]# make test
make[1]: Entering directory `/fs1/src/sybperl-2.15/BCP'
make[1]: Nothing to be done for `all'.
make[1]: Leaving directory `/fs1/src/sybperl-2.15/BCP'
make[1]: Entering directory `/fs1/src/sybperl-2.15/BLK'
make[1]: Nothing to be done for `all'.
make[1]: Leaving directory `/fs1/src/sybperl-2.15/BLK'
make[1]: Entering directory `/fs1/src/sybperl-2.15/CTlib'
make[1]: Leaving directory `/fs1/src/sybperl-2.15/CTlib'
make[1]: Entering directory `/fs1/src/sybperl-2.15/DBlib'
make[1]: Nothing to be done for `all'.
make[1]: Leaving directory `/fs1/src/sybperl-2.15/DBlib'
make[1]: Entering directory `/fs1/src/sybperl-2.15/Sybperl'
make[1]: Nothing to be done for `all'.
make[1]: Leaving directory `/fs1/src/sybperl-2.15/Sybperl'
make[1]: Entering directory `/fs1/src/sybperl-2.15/BCP'
make[1]: Nothing to be done for `test'.
make[1]: Leaving directory `/fs1/src/sybperl-2.15/BCP'
make[1]: Entering directory `/fs1/src/sybperl-2.15/BLK'
make[1]: Nothing to be done for `test'.
make[1]: Leaving directory `/fs1/src/sybperl-2.15/BLK'
make[1]: Entering directory `/fs1/src/sybperl-2.15/CTlib'
PERL_DL_NONLAZY=1 /usr/local/bin/perl "-MExtUtils::Command::MM" "-e" "test_harness(0, '../blib/lib', '../blib/arch')" t/*.t
t/ctlib......dubious
        Test returned status 0 (wstat 11, 0xb)
t/cursor.....dubious
        Test returned status 0 (wstat 11, 0xb)
t/nsql.......dubious
        Test returned status 0 (wstat 11, 0xb)
t/prepare....dubious
        Test returned status 0 (wstat 11, 0xb)
t/xblk.......dubious
        Test returned status 0 (wstat 11, 0xb)
FAILED--5 test scripts could be run, alas--no output ever seen
make[1]: *** [test_dynamic] Error 2
make[1]: Leaving directory `/fs1/src/sybperl-2.15/CTlib'
make: *** [test] Error 2

I'm at a loss about troubleshooting this now. Any help that can be offered
would be appreciated.

--Mark

-- 
http://www.wm7d.net/
http://www.wm7d.net/fcc_uls/ulsquery.html