PEPPLER.ORG
Michael Peppler
Sybase Consulting
Menu
Home
Sybase on Linux
Install Guide for Sybase on Linux
General Sybase Resources
General Perl Resources
Freeware
Sybperl
Sybase::Simple
DBD::Sybase
BCP Tool
Bug Tracker
Mailing List Archive
Downloads Directory
FAQs
Sybase on Linux FAQ
Sybperl FAQ
Personal
Michael Peppler's resume

sybperl-l Archive

Up    Prev    Next    

From: Jie Gao <J dot Gao at isu dot usyd dot edu dot au>
Subject: [sybperl-l] make test fails for dblib
Date: Jul 21 2000 6:20AM

Hi All,

OS:

SunOS lima 5.7 Generic_106541-11 sun4u sparc SUNW,Ultra-80

Per:

Summary of my perl5 (5.0 patchlevel 5 subversion 3) configuration:
  Platform:
    osname=solaris, osvers=2.7, archname=sun4-solaris
    uname='sunos lima 5.7 generic_106541-11 sun4u sparc sunw,ultra-80 '
    hint=recommended, useposix=true, d_sigaction=define
    usethreads=undef useperlio=undef d_sfio=undef
  Compiler:
    cc='gcc -B/usr/ccs/bin/', optimize='-O3', gccversion=2.95.2 19991024 (release)
    cppflags='-I/usr/local/include -I/opt/local/include'
    ccflags ='-I/usr/local/include -I/opt/local/include'
    stdchar='char', d_stdstdio=define, usevfork=false
    intsize=4, longsize=4, ptrsize=4, doublesize=8
    d_longlong=define, longlongsize=8, d_longdbl=define, longdblsize=16
    alignbytes=8, usemymalloc=n, prototype=define
  Linker and Libraries:
    ld='gcc -B/usr/ccs/bin/', ldflags =' -L/usr/local/lib -L/opt/local/lib'
    libpth=/usr/local/lib /opt/local/lib /lib /usr/lib /usr/ccs/lib
    libs=-lsocket -lnsl -ldl -lm -lc -lcrypt
    libc=/lib/libc.so, so=so, useshrplib=false, libperl=libperl.a
  Dynamic Linking:
    dlsrc=dl_dlopen.xs, dlext=so, d_dlsymun=undef, ccdlflags=' '
    cccdlflags='-fPIC', lddlflags='-G -L/usr/local/lib -L/opt/local/lib'


Characteristics of this binary (from libperl): 
  Built under solaris
  Compiled at Jul 19 2000 13:20:22
  @INC:
    /usr/local/lib/perl5/5.00503/sun4-solaris
    /usr/local/lib/perl5/5.00503
    /usr/local/lib/perl5/site_perl/5.005/sun4-solaris
    /usr/local/lib/perl5/site_perl/5.005

Sybperl:

Version: sybperl-2.12


Sybase:

11.9.3.

make test:

...
make[1]: Entering directory `/de1/src/lima/.cpan/build/sybperl-2.12/CTlib'
PERL_DL_NONLAZY=1 /usr/bin/perl -I../blib/arch -I../blib/lib -I/usr/local/lib/perl5/5.00503/sun4-solaris
-I/usr/local/lib/perl5/5.00503 -e 'use Test::Harness qw(&runtests $verbose); $verbose=0; runtests @ARGV;'
t/*.t
t/ctlib.............ok
t/cursor............ok
All tests successful.
Files=2,  Tests=52,  1 wallclock secs ( 0.39 cusr +  0.06 csys =  0.45 CPU)
make[1]: Leaving directory `/de1/src/lima/.cpan/build/sybperl-2.12/CTlib'
make[1]: Entering directory `/de1/src/lima/.cpan/build/sybperl-2.12/DBlib'
PERL_DL_NONLAZY=1 /usr/bin/perl -I../blib/arch -I../blib/lib -I/usr/local/lib/perl5/5.00503/sun4-solaris
-I/usr/local/lib/perl5/5.00503 -e 'use Test::Harness qw(&runtests $verbose); $verbose=0; runtests @ARGV;'
t/*.t
t/dblib.............FAILED tests 20-22
        Failed 3/22 tests, 86.36% okay
t/money.............ok
Failed Test  Status Wstat Total Fail  Failed  List of failed
-------------------------------------------------------------------------------
t/dblib.t                    22    3  13.64%  20-22
Failed 1/2 test scripts, 50.00% okay. 3/35 subtests failed, 91.43% okay.
make[1]: *** [test_dynamic] Error 29
make[1]: Leaving directory `/de1/src/lima/.cpan/build/sybperl-2.12/DBlib'
make: *** [test] Error 2




Jie