PEPPLER.ORG
Michael Peppler
Sybase Consulting
Menu
Home
Sybase on Linux
Install Guide for Sybase on Linux
General Sybase Resources
General Perl Resources
Freeware
Sybperl
Sybase::Simple
DBD::Sybase
BCP Tool
Bug Tracker
Mailing List Archive
Downloads Directory
FAQs
Sybase on Linux FAQ
Sybperl FAQ
Personal
Michael Peppler's resume

sybperl-l Archive

Up    Prev    Next    

From: "David Kings" <dkings at cerberus dot ib dot cdu dot itg dot telstra dot com dot au>
Subject: Error in compiling SybPerl
Date: May 25 1999 8:25AM

After chasing many links on the net regarding how to compile SybPerl, I 
think I have ironed out all of the obvious problems.

However, now, when I attempt to

make test

it fails with the following:

PERL_DL_NONLAZY=1 ./../perl -I../blib/arch -I../blib/lib -
I/usr/lib/perl5/5.00503/i586-linux -I/usr/lib/perl5/5.00503 -e 'use Test::Harness 
qw(&runtests $verbose); $verbose=0; runtests @ARGV;' t/*.t
t/ctlib.............
Open Client Message: (In msg_cb)
Message number: LAYER = (5) ORIGIN = (3) SEVERITY = (4) NUMBER = 
(3)
Message String: ct_connect(): network packet layer: internal net library error: 
Specified server name attribute could not be found
Can't call method "ct_execute" on an undefined value at t/ctlib.t line 49.
dubious
        Test returned status 255 (wstat 65280, 0xff00)
DIED. FAILED tests 2-30
        Failed 29/30 tests, 3.33% okay
t/cursor............
Open Client Message:
Message number: LAYER = (5) ORIGIN = (3) SEVERITY = (4) NUMBER = 
(3)
Message String: ct_connect(): network packet layer: internal net library error: 
Specified server name attribute could not be found
not ok 2
-- The user id/password combination may be invalid.
dubious
        Test returned status 255 (wstat 65280, 0xff00)
DIED. FAILED tests 2-22
        Failed 21/22 tests, 4.55% okay
Failed Test  Status Wstat Total Fail  Failed  List of failed
-------------------------------------------------------------------------------
t/ctlib.t       255 65280    30   29  96.67%  2-30
t/cursor.t      255 65280    22   21  95.45%  2-22
Failed 2/2 test scripts, 0.00% okay. 50/52 subtests failed, 3.85% okay.
make[1]: *** [test_static] Error 2
make[1]: Leaving directory `/opt/sybperl-2.10_01/CTlib'
make: *** [test] Error 2


I have not found any reference so far in numerous FAQs on how to fix this.  
Any suggestions?

Cheers



------------------------------------------------------------
David Kings	Phone: +61 8 8230-4689	Fax: +61 8 8230-4971
                      Mobile: 0419 839 740
                       Pager: 016080 Ask for 819081

Email addresses:
 Internet: (home)		dkings@monte.pcsa.net.au
 Internet: (work)		dkings@cerberus.ib.cdu.itg.telecom.com.au
 Microsoft Mail:	     dkings@sitgnib1.telecom.com.au

IBM Global Services Australia  		
Postal Address:				Street Address:
	Locked Bag 1311				9th Floor 30 Pirie St
	ADELAIDE SA 5800	     		ADELAIDE SA 5000
	AUSTRALIA		     		AUSTRALIA