PEPPLER.ORG
Michael Peppler
Sybase Consulting
Menu
Home
Sybase on Linux
Install Guide for Sybase on Linux
General Sybase Resources
General Perl Resources
Freeware
Sybperl
Sybase::Simple
DBD::Sybase
BCP Tool
Bug Tracker
Mailing List Archive
Downloads Directory
FAQs
Sybase on Linux FAQ
Sybperl FAQ
Personal
Michael Peppler's resume

sybperl-l Archive

Up    Prev    Next    

From: John Gilmore-Baldwin <john at dwx dot com>
Subject: Re: make test fails on Solaris 2.5.1
Date: Apr 29 1999 10:13PM

>John Gilmore-Baldwin writes:
> > I've tried this on two different machines.  I've got perl 5.004_04.  I'm
> > trying to install sybperl-2.10_01.  I get the following errors during make
> > test.  I'm just not sure what to do about this one:
> >
> > PERL_DL_NONLAZY=1 /usr/local/bin/perl -I.././blib/arch -I.././blib/lib
> > -I/usr/local/lib/perl5/sun4-solaris/5.00404 -I/usr/local/lib/perl5 -e 'use
> > Test::Harness qw(&runtests $verbose); $verbose=0; runtests @ARGV;' t/*.t
> > t/bcp...............Can't find 'boot_Sybase__DBlib' symbol in
> > .././blib/arch/auto/Sybase/DBlib/DBlib.so
>
>This is a new one... I'd like to see a full trace of a clean make if
>possible.
>

Sure thing.  Here it is:

dmr8:root:4:sybperl-2.10_01:# perl Makefile.PL
Writing Makefile for Sybase::BCP
Writing Makefile for Sybase::CTlib
Writing Makefile for Sybase::DBlib
Writing Makefile for Sybase::Sybperl
Writing Makefile for Sybase
dmr8:root:5:sybperl-2.10_01:# make
make[1]: Entering directory `/usr/local/baldwin/sybperl-2.10_01/BCP'
Manifying .././blib/man3/Sybase::BCP.3
make[1]: Leaving directory `/usr/local/baldwin/sybperl-2.10_01/BCP'
make[1]: Entering directory `/usr/local/baldwin/sybperl-2.10_01/CTlib'
cc -c -I/usr/local/sybase/include -I/opt/gnu/include -O
-DVERSION=\"2.10_01\" -DXS_VERSION=\"2.10_01\" -fpic
-I/usr/local/lib/perl5/sun4-solaris/5.00404/CORE -DCTLIBVS=100
-DSYBPLVER='"2.10_01"' -DDO_TIE CTlib.c
Running Mkbootstrap for Sybase::CTlib ()
chmod 644 CTlib.bs
LD_RUN_PATH="/usr/local/sybase/lib:/lib" cc -o
.././blib/arch/auto/Sybase/CTlib/CTlib.so -R/usr/local/sybase/lib -R/lib
-L/usr/local/sybase/lib -G -L/usr/local/lib -L/opt/gnu/lib CTlib.o
-L/usr/local/sybase/lib -lct -lcs -ltcl -lcomn -lintl -ltli -lnsl -lm
chmod 755 .././blib/arch/auto/Sybase/CTlib/CTlib.so
cp CTlib.bs .././blib/arch/auto/Sybase/CTlib/CTlib.bs
chmod 644 .././blib/arch/auto/Sybase/CTlib/CTlib.bs
make[1]: Leaving directory `/usr/local/baldwin/sybperl-2.10_01/CTlib'
make[1]: Entering directory `/usr/local/baldwin/sybperl-2.10_01/DBlib'
cc -c -I/usr/local/sybase/include -I/opt/gnu/include -O
-DVERSION=\"2.10_01\" -DXS_VERSION=\"2.10_01\" -fpic
-I/usr/local/lib/perl5/sun4-solaris/5.00404/CORE -DDBLIBVS=1000
-DSYBPLVER='"2.10_01"' -DDO_TIE DBlib.c
Running Mkbootstrap for Sybase::DBlib ()
chmod 644 DBlib.bs
LD_RUN_PATH="/usr/local/sybase/lib:/lib" cc -o
.././blib/arch/auto/Sybase/DBlib/DBlib.so -R/usr/local/sybase/lib -R/lib
-L/usr/local/sybase/lib -G -L/usr/local/lib -L/opt/gnu/lib DBlib.o
-L/usr/local/sybase/lib -lsybdb -ltli -lnsl -lm
chmod 755 .././blib/arch/auto/Sybase/DBlib/DBlib.so
cp DBlib.bs .././blib/arch/auto/Sybase/DBlib/DBlib.bs
chmod 644 .././blib/arch/auto/Sybase/DBlib/DBlib.bs
make[1]: Leaving directory `/usr/local/baldwin/sybperl-2.10_01/DBlib'
make[1]: Entering directory `/usr/local/baldwin/sybperl-2.10_01/Sybperl'
make[1]: Leaving directory `/usr/local/baldwin/sybperl-2.10_01/Sybperl'
dmr8:root:6:sybperl-2.10_01:# make test
make[1]: Entering directory `/usr/local/baldwin/sybperl-2.10_01/BCP'
make[1]: Leaving directory `/usr/local/baldwin/sybperl-2.10_01/BCP'
make[1]: Entering directory `/usr/local/baldwin/sybperl-2.10_01/CTlib'
make[1]: Leaving directory `/usr/local/baldwin/sybperl-2.10_01/CTlib'
make[1]: Entering directory `/usr/local/baldwin/sybperl-2.10_01/DBlib'
make[1]: Leaving directory `/usr/local/baldwin/sybperl-2.10_01/DBlib'
make[1]: Entering directory `/usr/local/baldwin/sybperl-2.10_01/Sybperl'
make[1]: Leaving directory `/usr/local/baldwin/sybperl-2.10_01/Sybperl'
make[1]: Entering directory `/usr/local/baldwin/sybperl-2.10_01/BCP'
PERL_DL_NONLAZY=1 /usr/local/bin/perl -I.././blib/arch -I.././blib/lib
-I/usr/local/lib/perl5/sun4-solaris/5.00404 -I/usr/local/lib/perl5 -e 'use
Test::Harness qw(&runtests $verbose); $verbose=0; runtests @ARGV;' t/*.t
t/bcp...............Can't find 'boot_Sybase__DBlib' symbol in
.././blib/arch/auto/Sybase/DBlib/DBlib.so
 at .././blib/lib/Sybase/BCP.pm line 277
BEGIN failed--compilation aborted at .././blib/lib/Sybase/BCP.pm line 277.
BEGIN failed--compilation aborted at t/bcp.t line 12.
dubious
        Test returned status 2 (wstat 512, 0x200)
DIED. FAILED tests 1-9
        Failed 9/9 tests, 0.00% okay
Failed Test  Status Wstat Total Fail  Failed  List of failed
-------------------------------------------------------------------------------
t/bcp.t           2   512     9    9 100.00%  1-9
Failed 1/1 test scripts, 0.00% okay. 9/9 subtests failed, 0.00% okay.
make[1]: *** [test_dynamic] Error 2
make[1]: Leaving directory `/usr/local/baldwin/sybperl-2.10_01/BCP'
make: *** [test] Error 2


>Michael
>--
>Michael Peppler         -||-  Data Migrations Inc.
>mpeppler@peppler.org    -||-  http://www.mbay.net/~mpeppler
>Int. Sybase User Group  -||-  http://www.isug.com
>Sybase on Linux mailing list: ase-linux-list@isug.com