PEPPLER.ORG
Michael Peppler
Sybase Consulting
Menu
Home
Sybase on Linux
Install Guide for Sybase on Linux
General Sybase Resources
General Perl Resources
Freeware
Sybperl
Sybase::Simple
DBD::Sybase
BCP Tool
Bug Tracker
Mailing List Archive
Downloads Directory
FAQs
Sybase on Linux FAQ
Sybperl FAQ
Personal
Michael Peppler's resume

sybperl-l Archive

Up    Prev    Next    

From: John Gilmore-Baldwin <john at dwx dot com>
Subject: make test fails on Solaris 2.5.1
Date: Apr 29 1999 8:17PM

I've tried this on two different machines.  I've got perl 5.004_04.  I'm
trying to install sybperl-2.10_01.  I get the following errors during make
test.  I'm just not sure what to do about this one:

PERL_DL_NONLAZY=1 /usr/local/bin/perl -I.././blib/arch -I.././blib/lib
-I/usr/local/lib/perl5/sun4-solaris/5.00404 -I/usr/local/lib/perl5 -e 'use
Test::Harness qw(&runtests $verbose); $verbose=0; runtests @ARGV;' t/*.t
t/bcp...............Can't find 'boot_Sybase__DBlib' symbol in
.././blib/arch/auto/Sybase/DBlib/DBlib.so
 at .././blib/lib/Sybase/BCP.pm line 277
BEGIN failed--compilation aborted at .././blib/lib/Sybase/BCP.pm line 277.
BEGIN failed--compilation aborted at t/bcp.t line 12.
dubious
        Test returned status 2 (wstat 512, 0x200)
DIED. FAILED tests 1-9
        Failed 9/9 tests, 0.00% okay
Failed Test  Status Wstat Total Fail  Failed  List of failed
-------------------------------------------------------------------------------
t/bcp.t           2   512     9    9 100.00%  1-9
Failed 1/1 test scripts, 0.00% okay. 9/9 subtests failed, 0.00% okay.
make[1]: *** [test_dynamic] Error 2
make[1]: Leaving directory `/usr/local/baldwin/sybperl-2.10_01/BCP'
make: *** [test] Error 2