PEPPLER.ORG
Michael Peppler
Sybase Consulting
Menu
Home
Sybase on Linux
Install Guide for Sybase on Linux
General Sybase Resources
General Perl Resources
Freeware
Sybperl
Sybase::Simple
DBD::Sybase
BCP Tool
Bug Tracker
Mailing List Archive
Downloads Directory
FAQs
Sybase on Linux FAQ
Sybperl FAQ
Personal
Michael Peppler's resume

sybperl-l Archive

Up    Prev    Next    

From: "Herring, Nathan A" <nathan dot a dot herring at lmco dot com>
Subject: Installation on Solaris 2.5.1
Date: Apr 9 1999 6:43PM

Hello all-

I am new to Sybperl and am trying to install it on a Sun Ultra1.  By
following the instructions I have gotten to the 'make test'.  However the
make test errors and stops, here is selected output from the 'make test':

@@@@@@@@@@@@@@@@@@@@@@@@@@@@@@@@@@@@@@@@@@@@@@@@@@@@@@@@@@@@@@@@@@@@@@@@@@
make[1]: Leaving directory `/orac2/sybperl-2.09_05/CTlib'
make[1]: Entering directory `/orac2/sybperl-2.09_05/DBlib'
PERL_DL_NONLAZY=1 /net/bigdog/usr/local/bin/perl -I../blib/arch
-I../blib/lib -I/usr/local/lib/perl5/5.00501/sun4-solaris
-I/usr/local/lib/perl5/5.00501 -e 'use Test::Harness qw(&runtests $verbose);
$verbose=0; runtests @ARGV;' t/*.t
t/dblib.............Can't call method "dbsqlok" on an undefined value at
t/dblib.t line 132.
dubious
        Test returned status 255 (wstat 65280, 0xff00)
DIED. FAILED tests 20-22
        Failed 3/22 tests, 86.36% okay
t/money.............ok
Failed Test  Status Wstat Total Fail  Failed  List of failed
----------------------------------------------------------------------------
---
t/dblib.t       255 65280    22    3  13.64%  20-22
Failed 1/2 test scripts, 50.00% okay. 3/35 subtests failed, 91.43% okay.
make[1]: *** [test_dynamic] Error 9
make[1]: Leaving directory `/orac2/sybperl-2.09_05/DBlib'
make: *** [test] Error 2
@@@@@@@@@@@@@@@@@@@@@@@@@@@@@@@@@@@@@@@@@@@@@@@@@@@@@@@@@@@@@@@@@@@@@@@@@@

Thanks for the help in advance.

Nate Herring
nathan.a.herring@lmco.com