PEPPLER.ORG
Michael Peppler
Sybase Consulting
Menu
Home
Sybase on Linux
Install Guide for Sybase on Linux
General Sybase Resources
General Perl Resources
Freeware
Sybperl
Sybase::Simple
DBD::Sybase
BCP Tool
Bug Tracker
Mailing List Archive
Downloads Directory
FAQs
Sybase on Linux FAQ
Sybperl FAQ
Personal
Michael Peppler's resume

sybperl-l Archive

Up    Prev    Next    

From: wlee at spspme dot ml dot com (William Lee)
Subject: Re: make test error
Date: Jun 29 1998 4:34PM

Sorry please ignore this mail.



>>From wlee@spspme.ml.com Mon Jun 29 12:33:26 1998
>>Date: Mon, 29 Jun 1998 12:28:43 -0400
>>From: wlee@spspme.ml.com (William Lee)
>>Subject: make test error
>>To: SybPerl Discussion List 
>>Cc: wlee@ML.COM
>>X-Listprocessor-Version: 8.2.07 -- ListProc(tm) by CREN
>>
>> 
>>> Hi,
>>> 
>>>   I got the following error while I was tried to do 'make test'.  I did not do 
>>> the 'make' as 'root', will this be a problem ? 
>>>  
>>>  Thanks.
>>> --
>>> ============================================================================
>>> William Lee                                   voice : (212) 449-7598
>>> Sybase DBA                                   e-mail : wlee@ml.com
>>> http://www.merrill-lynch.com                  
>>> ============================================================================
>>> 
>>> (66) sybase% make test
>>>   make test
>>> PERL_DL_NONLAZY=1 .././perl -I.././blib/arch -I.././blib/lib 
>>> -I/usr/local/lib/perl5/sun4-solaris/5.003 -I/usr/local/lib/perl5 -e 'use 
>>> Test::Harness qw(&runtests $verbose); $verbose=0; runtests @ARGV;' t/*.t
>>> t/bcp...............Sybase error: Could not open interface file.
>>> OS Error: No such file or directory
>>> Can't call method "sql" without a package or object reference at t/bcp.t line 
>>> 47.
>>> FAILED tests 2-9
>>>         Failed 8/9 tests, 11.11% okay
>>>         Test returned status 255 (wstat 65280)
>>> Failed 1 test script, 0.00% okay. 8/9 subtests failed, 11.11% okay.
>>> *** Error code 29
>>> make: Fatal error: Command failed for target `test_dynamic'
>>> Current working directory /export1/opt/sybperl-2.09_05/BCP
>>> *** Error code 1
>>> make: Fatal error: Command failed for target `test'
>>> (112) sissunz: export SYBASE=/apps/sybase
>>> (113) sissunz: make test
>>> PERL_DL_NONLAZY=1 .././perl -I.././blib/arch -I.././blib/lib 
>>> -I/usr/local/lib/perl5/sun4-solaris/5.003 -I/usr/local/lib/perl5 -e 'use 
>>> Test::Harness qw(&runtests $verbose); $verbose=0; runtests @ARGV;' t/*.t
>>> t/bcp...............ok
>>> All tests successful.
>>> Files=1,  Tests=9,  1 secs ( 0.47 cusr  0.20 csys =  0.67 cpu)
>>> PERL_DL_NONLAZY=1 .././perl -I.././blib/arch -I.././blib/lib 
>>> -I/usr/local/lib/perl5/sun4-solaris/5.003 -I/usr/local/lib/perl5 -e 'use 
>>> Test::Harness qw(&runtest $verbose); $verbose=0; runtests @ARGV;' t/*.t
>>> t/ctlib.............
>>> Open Client Message:
>>> Message number: LAYER = (5) ORIGIN = (3) SEVERITY = (5) NUMBER = (131)
>>> Message String: ct_init(): network packet layer: internal net library error: 
>>> Error string not available
>>> Sybase::CTlib initialize: ct_init() failed at /usr/local/lib/perl5/DynaLoader.pm 
>>> line 153.
>>> BEGIN failed--compilation aborted at t/ctlib.t line 8.
>>> FAILED tests 1-30
>>>         Failed 30/30 tests, 0.00% okay
>>>         Test returned status 2 (wstat 512)
>>> t/cursor............
>>> Open Client Message:
>>> Message number: LAYER = (5) ORIGIN = (3) SEVERITY = (5) NUMBER = (131)
>>> Message String: ct_init(): network packet layer: internal net library error: 
>>> Error string not available
>>> Sybase::CTlib initialize: ct_init() failed at /usr/local/lib/perl5/DynaLoader.pm 
>>> line 153.
>>> BEGIN failed--compilation aborted at t/cursor.t line 12.
>>> FAILED tests 1-22
>>>         Failed 22/22 tests, 0.00% okay
>>>         Test returned status 2 (wstat 512)
>>> Failed 2/2 test scripts, 0.00% okay. 52/52 subtests failed, 0.00% okay.
>>> *** Error code 29
>>> make: Fatal error: Command failed for target `test_dynamic'
>>> Current working directory /export1/opt/sybperl-2.09_05/CTlib
>>> *** Error code 1
>>> make: Fatal error: Command failed for target `test'
>>> 
>>