PEPPLER.ORG
Michael Peppler
Sybase Consulting
Menu
Home
Sybase on Linux
Install Guide for Sybase on Linux
General Sybase Resources
General Perl Resources
Freeware
Sybperl
Sybase::Simple
DBD::Sybase
BCP Tool
Bug Tracker
Mailing List Archive
Downloads Directory
FAQs
Sybase on Linux FAQ
Sybperl FAQ
Personal
Michael Peppler's resume

sybperl-l Archive

Up    Prev    Next    

From: Thanasis Bothos <thanasis at UCLINK4 dot BERKELEY dot EDU>
Subject: help with make test error
Date: Dec 3 1998 10:48PM

Hello,
make test give me the following error.
Any ideas how to resolve this

Sybperl 2.09_05
Sybase 11.02
Solaris 2.6

...
t/bcp...............Sybase error: SQL Server connection timed out.
Can't call method "sql" without a package or object reference at t/bcp.t
line 47.
dubious
        Test returned status 255 (wstat 65280, 0xff00)
DIED. FAILED tests 2-9
        Failed 8/9 tests, 11.11% okay
Failed Test  Status Wstat Total Fail  Failed  List of failed
----------------------------------------------------------------------------
---
t/bcp.t         255 65280     9    8  88.89%  2-9
Failed 1/1 test scripts, 0.00% okay. 8/9 subtests failed, 11.11% okay.
make[1]: *** [test_dynamic] Error 2
make[1]: Leaving directory `/local/src/sybperl/sybperl-2.09_05/BCP'
make: *** [test] Error 2

Thanks



--------------------------------------------------------
Thanasis Bothos
IST-ASD
Data Warehousing/Decision Support
2-8704