PEPPLER.ORG
Michael Peppler
Sybase Consulting
Menu
Home
Sybase on Linux
Install Guide for Sybase on Linux
General Sybase Resources
General Perl Resources
Freeware
Sybperl
Sybase::Simple
DBD::Sybase
BCP Tool
Bug Tracker
Mailing List Archive
Downloads Directory
FAQs
Sybase on Linux FAQ
Sybperl FAQ
Personal
Michael Peppler's resume

sybperl-l Archive

Up    Prev    Next    

From: Anil Sodhy <asodhy at clark dot net>
Subject: Errors running 'make test'
Date: Nov 10 1998 1:02AM

I followed the instructions in the README file for installing sybperl
2.09 under RedHat 5.1(Linux 2.0.34) with perl 5.004_04 built for
i386-linux.  

When I ran 'make test' I received the following messages:

"
make[1]: Entering directory `/sybperl-2.09/BCP'
make[1]: Leaving directory `/sybperl-2.09/BCP'
make[1]: Entering directory `/sybperl-2.09/CTlib'
make[1]: Leaving directory `/sybperl-2.09/CTlib'
make[1]: Entering directory `/sybperl-2.09/DBlib'
make[1]: Leaving directory `/sybperl-2.09/DBlib'
make[1]: Entering directory `/sybperl-2.09/Sybperl'
make[1]: Leaving directory `/sybperl-2.09/Sybperl'
make[1]: Entering directory `/sybperl-2.09/BCP'
PERL_DL_NONLAZY=1 /usr/bin/perl -I.././blib/arch -I.././blib/lib
-I/usr/lib/perl5/i386-linux/5
.00404 -I/usr/lib/perl5 -e 'use Test::Harness qw(&runtests $verbose);
$verbose=0; runtests @AR
GV;' t/*.t
t/bcp...............Can't call method "sql" without a package or object
reference at t/bcp.t l
ine 47.
dubious
        Test returned status 22 (wstat 5632, 0x1600)
DIED. FAILED tests 2-9
        Failed 8/9 tests, 11.11% okay
Failed Test  Status Wstat Total Fail  Failed  List of failed
-------------------------------------------------------------------------------
t/bcp.t          22  5632     9    8  88.89%  2-9
Failed 1/1 test scripts, 0.00% okay. 8/9 subtests failed, 11.11% okay.
make[1]: *** [test_dynamic] Error 2
make[1]: Leaving directory `/sybperl-2.09/BCP'
make: *** [test] Error 2
"

What am I doing incorrectly?


Anil K. Sodhy (asodhy@clark.net)