PEPPLER.ORG
Michael Peppler
Sybase Consulting
Menu
Home
Sybase on Linux
Install Guide for Sybase on Linux
General Sybase Resources
General Perl Resources
Freeware
Sybperl
Sybase::Simple
DBD::Sybase
BCP Tool
Bug Tracker
Mailing List Archive
Downloads Directory
FAQs
Sybase on Linux FAQ
Sybperl FAQ
Personal
Michael Peppler's resume

sybperl-l Archive

Up    Prev    Next    

From: Jun Zhang <junz at tpg dot com>
Subject: problem on sybperl install
Date: Jan 26 1998 9:52PM

>
> I am installing sybperl 2.09 on the top of perl5.004_04. The server is   
    

> SunOS 5.2.1 and sybase is  OpenClient 10.04 , Sever is 11.03
>
> I finished "make" without any error messages.
>
> When I run "make test"  I got the following error:
>
> make[1]: Entering directory   
'/usr/local/perl5.004_4/ext/sybperl-2.09/BCP'
> make[1]: Leaving directory   
'/usr/local/perl5.004_4/ext/sybperl-2.09/BCP'
> make[1]: Entering directory
> '/usr/local/perl5.004_4/ext/sybperl-2.09/CTlib'
> make[1]: Leaving directory
> '/usr/local/perl5.004_4/ext/sybperl-2.09/CTlib'
> make[1]: Entering directory
> '/usr/local/perl5.004_4/ext/sybperl-2.09/DBlib'
> make[1]: Leaving directory
> '/usr/local/perl5.004_4/ext/sybperl-2.09/DBlib'
> make[1]: Entering directory
> '/usr/local/perl5.004_4/ext/sybperl-2.09/Sybperl'
> make[1]: Leaving directory
> '/usr/local/perl5.004_4/ext/sybperl-2.09/Sybperl'
> make[1]: Entering directory   
'/usr/local/perl5.004_4/ext/sybperl-2.09/BCP'
> PERL_DL_NONLAZY=1 /usr/local/perl5.004_4/bin/perl5.00404   
 -I.././blib/arch
>  -I.././blib/ib -I/usr/local/perl5.004_4/lib/sun4-solaris/5.00404
>  -I/usr/local/perl5.004_4/lib -e 'se Test::Harness qw(&runtests   
$verbose);
   

> $verbose=0; runtests @ARGV;' t/*.t
> t/bcp...............Can't load
> '.././blib/arch/auto/Sybase/DBlib/DBlib.so' for module ybase::DBlib:
> ld.so.1: /usr/local/perl5.004_4/bin/perl5.00404: fatal: relocation   
error
> symbol not found: svr4_tli: referenced in /opt/sybase/lib/libtcl.so at   
    

> /usr/local/per5.004_4/lib/sun4-solaris/5.00404/DynaLoader.pm line 166.
>
>
>  at .././blib/lib/Sybase/BCP.pm line 277
> BEGIN failed-compilation aborted at .././blib/lib/Sybase/BCP.pm line
> 277.
> BEGIN failed-compilation aborted at t/bcp.t line 12.
> dubious
>         Test returned status 2 (wstat 512, 0x200)
> DIED. FAILED tests 1-9
>         Failed 9/9 tests, 0.00% okay
> Failed Test  Status Wstat Total Fail  Failed  List of failed
>   
 -------------------------------------------------------------------------  
 -
   

>  -----
> t/bcp.t           2   512     9    9 100.00%  1-9
> Failed 1/1 test scripts, 0.00% okay. 9/9 subtests failed, 0.00% okay.
> make[1]: *** [test_dynamic] Error 2
> make[1]: Leaving directory   
'/usr/local/perl5.004_4/ext/sybperl-2.09/BCP'
> make: *** [test] Error 1
>
>
> Has anyone seen this error? How to solve it?
> I already rename file /usr/local/lib/ libtcl.a to libtcl.a.sav.
>
>
> Thanks a lot.
>

Junz@tpg.com
Ext. 914-946-6060 ext. 229