PEPPLER.ORG
Michael Peppler
Sybase Consulting
Menu
Home
Sybase on Linux
Install Guide for Sybase on Linux
General Sybase Resources
General Perl Resources
Freeware
Sybperl
Sybase::Simple
DBD::Sybase
BCP Tool
Bug Tracker
Mailing List Archive
Downloads Directory
FAQs
Sybase on Linux FAQ
Sybperl FAQ
Personal
Michael Peppler's resume

sybperl-l Archive

Up    Prev    Next    

From: "Cheng, Victor" <Victor-Cheng at deshaw dot com>
Subject: RE: Trying to install sybperl 2.08_51 on WinNT
Date: Dec 18 1997 4:35PM

I think you can edit the t\bcp.t to add a self-assignment code to avoid
this warning and the unnecessary abortion of the test. I had a similar
problem with CTlib, and adding the self-assignment code to CTlib.pm near
the export statement won't pass the compilation.

> -----Original Message-----
> From:	Issac Levin [SMTP:Issac_Levin@techsol.com]
> Sent:	Wednesday, December 17, 1997 3:12 PM
> To:	sybperl-l@trln.lib.unc.edu
> Subject:	Trying to install sybperl 2.08_51 on WinNT
> 
> 
> Dear Sir/Madam,
> 
> I am trying to install sybperl 2.08_51 on WinNT 4.0 service pack 3
> using
> MSVC++ 5.0. Everything goes ok until I run 'nmake test' which gives
> the
> errors below. I have perl 5.004_02 and open client 10.0.3. Any help or
> hints would be greatly appreciated.
> 
> Thank you for your help in advance,
> 
> ---Issac.
> 
> Errors:
> 
> Microsoft (R) Program Maintenance Utility   Version 1.62.7022
> Copyright (C) Microsoft Corp 1988-1997. All rights reserved.
> 
>      rem
>      rem
>      rem
>      rem
>      C:\perl\bin\perl -Mblib -Ic:\perl\lib -Ic:\perl\lib -e "use
> Test::Harness qw(&runtests $verbose); $verbose=0; runtests @ARGV;"
> t\bcp.t
> Using C:/TEMP/sybperl/sybperl-2.08_51/BCP/../blib
> t\bcp...............Name "Sybase::DBlib::Version" used only once:
> possible
> typo at c:\perl\lib/DynaLoader.pm line 172.
> Name "main::SybperlVer" used only once: possible typo at
> c:\perl\lib/DynaLoader.pm line 172.
> FAILED test 9
>      Failed 1/9 tests, 88.89% okay
> Failed Test  Status Wstat Total Fail  Failed  List of failed
> ----------------------------------------------------------------------
> -----
> ---
> t\bcp.t                       9    1  11.11%  9
> Failed 1/1 test scripts, 0.00% okay. 1/9 subtests failed, 88.89% okay.
> NMAKE : fatal error U1077: 'C:\perl\bin\perl' : return code '0x20'
> Stop.
> NMAKE : fatal error U1077: 'cd' : return code '0x2'
> Stop.
> 
> 
>