PEPPLER.ORG
Michael Peppler
Sybase Consulting
Menu
Home
Sybase on Linux
Install Guide for Sybase on Linux
General Sybase Resources
General Perl Resources
Freeware
Sybperl
Sybase::Simple
DBD::Sybase
BCP Tool
Bug Tracker
Mailing List Archive
Downloads Directory
FAQs
Sybase on Linux FAQ
Sybperl FAQ
Personal
Michael Peppler's resume

sybperl-l Archive

Up    Prev    Next    

From: Anibal A Acero <aacero at lehman dot com>
Subject: Sybperl 2.0.3 fails 'make test'
Date: Feb 29 1996 1:20AM

Hi folks,

This is my first attempt to compile sybperl and I don't use it, so please 
pardon any obvious mistakes.

I'm trying to get sybperl running on a Sparc10 run SunOS 4.1.3.  I just 
compiled perl5.002gamma with gcc 2.7.2; it failed only the lib/odbm test, 
which I do not believe is going affect sybperl. (It also fails lib/odbm 
with the bundled cc, so I don't think it's a gcc issue.)  Here's my CONFIG 
file with the comments stripped out:
89 llama:~/sybperl-2.03 uname -a
SunOS llama 4.1.3 14 sun4m
88 llama:~/sybperl-2.03 grep -v ^# CONFIG
DBLIBVS=1000
CTLIBVS=0
SYBASE=/afs/lehman.com/environs/sybase/opnclient/10.0.3/@sys
EXTRA_LIBS=
EXTRA_DEFS=

The 'perl Makefile.PL' and 'make' go smoothly, without warnings or errors. 
 'make test', however, fails with:
85 llama:~/sybperl-2.03 make test
make[1]: Entering directory `/export/home/aacero/sybperl-2.03/CTlib'
make[1]: Nothing to be done for `all'.
make[1]: Leaving directory `/export/home/aacero/sybperl-2.03/CTlib'
make[1]: Entering directory `/export/home/aacero/sybperl-2.03/DBlib'
make[1]: Leaving directory `/export/home/aacero/sybperl-2.03/DBlib'
make[1]: Entering directory `/export/home/aacero/sybperl-2.03/Sybperl'
make[1]: Leaving directory `/export/home/aacero/sybperl-2.03/Sybperl'
make[1]: Entering directory `/export/home/aacero/sybperl-2.03/CTlib'
make[1]: Nothing to be done for `test'.
make[1]: Leaving directory `/export/home/aacero/sybperl-2.03/CTlib'
make[1]: Entering directory `/export/home/aacero/sybperl-2.03/DBlib'
PERL_DL_NONLAZY=1 /home/aacero/local_share/perl5/bin/perl -I../blib/arch/ 
-I../b
lib/lib/ -I/home/aacero/local_share/perl5/lib/sun4-sunos/5.002 
-I/home/aacero/lo
cal_share/perl5/lib -e 'use Test::Harness qw(&runtests $verbose); 
$verbose=0; ru
ntests @ARGV;' t/*.t
t/dblib.............Subroutine Sybase::DBlib::SUCCEED redefined at (eval 
2) line
 1.
Subroutine Sybase::DBlib::NO_MORE_RESULTS redefined at (eval 5) line 1.
Subroutine Sybase::DBlib::FAIL redefined at (eval 8) line 1.
Aborting test: output counter mismatch [test 12 answered when test 13 
expected]
FAILED tests 13-16
        Failed 4/16 tests, 75.00% okay
Failed 1 test script, 0.00% okay. 3/16 subtests failed, 81.25% okay.
make[1]: *** [test_dynamic] Error 2
make[1]: Leaving directory `/export/home/aacero/sybperl-2.03/DBlib'
make: *** [test] Error 2

Any suggestions would be greatly appreciated!

Thanks,

Tony Acero

-- 
Tony Acero - Lehman Brothers - Back Office/Branch Sys. Admin.
101 Hudson, 34th Floor, Desk 412
(201) 524-4097  || aacero@lehman.com